Target
5-hydroxytryptamine receptor 2A
Ligand
BDBM84933
Substrate
Ki
3.6±n/a nM
Comments
PDSP_1132
Citation
 Nelson, DLLucaites, VLAudia, JENissen, JSWainscott, DB Species differences in the pharmacology of the 5-hydroxytryptamine2 receptor: structurally specific differentiation by ergolines and tryptamines. J Pharmacol Exp Ther 265:1272-9 (1993) Target
Name:
5-hydroxytryptamine receptor 2A
Synonyms:
5-HT-2 5-HT2 5HT2A_PIG Serotonin 2a (5-HT2a) receptor
Type:
Enzyme Catalytic Domain
Mol. Mass.:
52679.13
Organism:
PIG
Description:
5-HT2 0 0::P50129
Residue:
470
  
Inhibitor
Name:
BDBM84933
Synonyms:
6-Methyl-N-cyclohexylergoline-8-beta-carboxamide LY-193525
Type:
Small organic molecule
Emp. Form.:
C22H29N3O
Mol. Mass.:
351.4852
SMILES:
CN1C[C@@H](C[C@H]2[C@H]1Cc1c[nH]c3cccc2c13)C(=O)NC1CCCCC1
: