Target
5-hydroxytryptamine receptor 2C
Ligand
BDBM84937
Substrate
Ki
2.8±n/a nM
Comments
PDSP_1137
Citation
 Nelson, DLLucaites, VLAudia, JENissen, JSWainscott, DB Species differences in the pharmacology of the 5-hydroxytryptamine2 receptor: structurally specific differentiation by ergolines and tryptamines. J Pharmacol Exp Ther 265:1272-9 (1993) Target
Name:
5-hydroxytryptamine receptor 2C
Synonyms:
5-HT-2C 5-HT2C-INI 5-HTR2C 5-hydroxytryptamine receptor 2C (5-HT-2C) 5HT-1C HTR1C Serotonin (5-HT3) receptor Serotonin Receptor 2C
Type:
G Protein-Coupled Receptor (GPCR)
Mol. Mass.:
51836.79
Organism:
Homo sapiens (Human)
Description:
P28335
Residue:
458
  
Inhibitor
Name:
BDBM84937
Synonyms:
6-Methylergoline-8¿¿¿¿-carboxylic acid 4-methoxycyclohexyl ester LY 254239 | LY-254239
Type:
Small organic molecule
Emp. Form.:
C23H30N2O3
Mol. Mass.:
382.4959
SMILES:
COC1CCC(CC1)OC(=O)[C@@H]1C[C@H]2[C@@H](Cc3c[nH]c4cccc2c34)N(C)C1
: