Target
5-hydroxytryptamine receptor 2A
Ligand
BDBM30704
Substrate
Ki
0.76±n/a nM
Comments
PDSP_1209
Citation
 Nelson, DLLucaites, VLAudia, JENissen, JSWainscott, DB Species differences in the pharmacology of the 5-hydroxytryptamine2 receptor: structurally specific differentiation by ergolines and tryptamines. J Pharmacol Exp Ther 265:1272-9 (1993) Target
Name:
5-hydroxytryptamine receptor 2A
Synonyms:
5-HT-2A 5-HT2A 5-hydroxytryptamine receptor 2A (5HT2A) Htr2 Serotonin Receptor 2A
Type:
G Protein-Coupled Receptor (GPCR)
Mol. Mass.:
52852.05
Organism:
Rattus norvegicus (rat)
Description:
Rat cortex membranes 5-HT2A receptors.
Residue:
471
  
Inhibitor
Name:
BDBM30704
Synonyms:
(phenylmethyl) N-[[(6aR,9S,10aR)-4,7-dimethyl-6,6a,8,9,10,10a-hexahydroindolo[4,3-fg]quinoline-9-yl]methyl]carbamate METERGOLINE N-[[(6aR,9S,10aR)-4,7-dimethyl-6,6a,8,9,10,10a-hexahydroindolo[4,3-fg]quinoline-9-yl]methyl]carbamic acid (phenylmethyl) ester SMR000059050 cid_28693
Type:
Small organic molecule
Emp. Form.:
C25H29N3O2
Mol. Mass.:
403.5167
SMILES:
CN1C[C@H](CNC(=O)OCc2ccccc2)C[C@H]2[C@H]1Cc1cn(C)c3cccc2c13
: