Target
Sigma non-opioid intracellular receptor 1
Ligand
BDBM84951
Substrate
Ki
12.58±n/a nM
Comments
PDSP_1624
Citation
 Eglen, RMBonhaus, DWJohnson, LGLeung, EClark, RD Pharmacological characterization of two novel and potent 5-HT4 receptor agonists, RS 67333 and RS 67506, in vitro and in vivo. Br J Pharmacol 115:1387-92 (1995)  
Target
Name:
Sigma non-opioid intracellular receptor 1
Synonyms:
OPRS1 SIGMAR1 Sigma non-opioid intracellular receptor 1 Sigma1-receptor Sterol isomerase-like protein
Type:
Protein
Mol. Mass.:
25307.17
Organism:
Cavia porcellus (Guinea pig)
Description:
Q60492
Residue:
223
  
Inhibitor
Name:
BDBM84951
Synonyms:
CAS_133075 RS 67506
Type:
Small organic molecule
Emp. Form.:
C18H28ClN3O4S
Mol. Mass.:
417.951
SMILES:
COc1cc(N)c(Cl)cc1C(=O)CCC1CCN(CCNS(C)(=O)=O)CC1
: