Target
D(2) dopamine receptor
Ligand
BDBM50008782
Substrate
Ki
0.06±n/a nM
Comments
PDSP_789
Citation
 Seeman, PVan Tol, HH Deriving the therapeutic concentrations for clozapine and haloperidol: the apparent dissociation constant of a neuroleptic at the dopamine D2 or D4 receptor varies with the affinity of the competing radioligand. Eur J Pharmacol 291:59-66 (1995)  
Target
Name:
D(2) dopamine receptor
Synonyms:
D(2) dopamine receptor DOPAMINE D2 Long DRD2 Dopamine D2 receptor Dopamine D2 receptor (D2R) Dopamine2-like | d2
Type:
Cell-surface receptors
Mol. Mass.:
50647.10
Organism:
Homo sapiens (Human)
Description:
P14416
Residue:
443
  
Inhibitor
Name:
BDBM50008782
Synonyms:
CHEMBL44237 Epidepride;N-(1-Ethyl-pyrrolidin-2-ylmethyl)-5-iodo-2,3-dimethoxy-benzamide | N-(1-Ethyl-pyrrolidin-2-ylmethyl)-5-iodo-2,3-dimethoxy-benzamide (epidepride)
Type:
Small organic molecule
Emp. Form.:
C16H23IN2O3
Mol. Mass.:
418.2699
SMILES:
CCN1CCC[C@H]1CNC(=O)c1cc(I)cc(OC)c1OC
: