Target
Tyrosine-protein kinase JAK2
Ligand
BDBM198219
Substrate
Meas. Tech.
Enzyme Assay
Temperature
298.15±n/a K
IC50
40.0±n/a nM
Comments
extracted
Citation
 Hayashi, KWatanabe, TToyama, KKamon, JMinami, MUni, MNasu, M Substituted pyrrolo[3′,2′:5,6]pyrido[4,3-d]pyrimidines and JAK inhibitors comprising the same US Patent  US9556187 Publication Date 1/31/2017 
Target
Name:
Tyrosine-protein kinase JAK2
Synonyms:
JAK-2 JAK2_HUMAN Janus kinase 2 (JAK2) | Janus kinase 2 (a protein tyrosine kinase)
Type:
Protein
Mol. Mass.:
130684.68
Organism:
Homo sapiens (Human)
Description:
O60674
Residue:
1132
  
Inhibitor
Name:
BDBM198219
Synonyms:
US9216999, 27 | US9556187, Example 27
Type:
Small organic molecule
Emp. Form.:
C12H14N6
Mol. Mass.:
242.2798
SMILES:
C1CC(CCN1)c1nnn2cnc3[nH]ccc3c12
: