Target
Tyrosine-protein kinase BTK
Ligand
BDBM249997
Substrate
Meas. Tech.
Kinase Assay
Temperature
298.15±n/a K
IC50
0.150±n/a nM
Comments
extracted
Citation
 Wang, ZGuo, Y Substituted imidazo[1,2-b]pyrazoles as bruton'S tyrosine kinase modulators US Patent  US9556188 Publication Date 1/31/2017 
Target
Name:
Tyrosine-protein kinase BTK
Synonyms:
AGMX1 Agammaglobulinaemia tyrosine kinase B cell progenitor kinase BPK BTK_HUMAN Tyrosine Kinase BTK Tyrosine-protein kinase BTK (BTK)
Type:
Enzyme
Mol. Mass.:
76289.95
Organism:
Homo sapiens (Human)
Description:
Q06187
Residue:
659
  
Inhibitor
Name:
BDBM249997
Synonyms:
US10005782, Compound 123 US9556188, Compound 123
Type:
Small organic molecule
Emp. Form.:
C25H23N5O3
Mol. Mass.:
441.4818
SMILES:
NC(=O)c1c(nn2c3CN(CCCc3[nH]c12)C(=O)C=C)-c1ccc(Oc2ccccc2)cc1
: