Target
Tyrosine-protein kinase BTK
Ligand
BDBM250013
Substrate
Meas. Tech.
Kinase Assay
Temperature
298.15±n/a K
IC50
0.380±n/a nM
Comments
extracted
Citation
 Wang, ZGuo, Y Substituted imidazo[1,2-b]pyrazoles as bruton'S tyrosine kinase modulators US Patent  US9556188 Publication Date 1/31/2017 
Target
Name:
Tyrosine-protein kinase BTK
Synonyms:
AGMX1 Agammaglobulinaemia tyrosine kinase B cell progenitor kinase BPK BTK_HUMAN Tyrosine Kinase BTK Tyrosine-protein kinase BTK (BTK)
Type:
Enzyme
Mol. Mass.:
76289.95
Organism:
Homo sapiens (Human)
Description:
Q06187
Residue:
659
  
Inhibitor
Name:
BDBM250013
Synonyms:
US10005782, Compound 135 US9556188, Compound 135
Type:
Small organic molecule
Emp. Form.:
C26H24N6O3
Mol. Mass.:
468.5072
SMILES:
NC(=O)c1c2NCCC(C3CN(C3)C(=O)C=C)n2nc1-c1ccc(Oc2ccccc2C#N)cc1
: