Target
Alpha-glucosidase MAL12
Ligand
BDBM84973
Substrate
Meas. Tech.
Inhibition Assay
IC50
5.88e+4± 8e+2 nM
Citation
 Kim, JYLee, JWKim, YSLee, YRyu, YBKim, SRyu, HWCurtis-Long, MJLee, KWLee, WSPark, KH A novel competitive class of α-glucosidase inhibitors: (E)-1-phenyl-3-(4-styrylphenyl)urea derivatives. Chembiochem 11:2125-31 (2010)  
Target
Name:
Alpha-glucosidase MAL12
Synonyms:
α-Glucosidase MAL12_YEAST Maltase | alpha-Glucosidase (α-Glucosidase)
Type:
Protein
Mol. Mass.:
68084.32
Organism:
Saccharomyces cerevisiae
Description:
P53341
Residue:
584
  
Inhibitor
Name:
BDBM84973
Synonyms:
Urea derivative, 17
Type:
Small organic molecule
Emp. Form.:
C21H18N2O3
Mol. Mass.:
346.3792
SMILES:
Oc1cc(O)cc(\C=C\c2ccc(NC(=O)Nc3ccccc3)cc2)c1
: