Target
Mitogen-activated protein kinase 14
Ligand
BDBM84976
Substrate
Meas. Tech.
Kinase Assay
Temperature
310.15±0 K
IC50
1.63e+4± 9e+2 nM
Citation
 Goettert, MSchattel, VKoch, PMerfort, ILaufer, S Biological evaluation and structural determinants of p38α mitogen-activated-protein kinase and c-Jun-N-terminal kinase 3 inhibition by flavonoids. Chembiochem 11:2579-88 (2010)  
Target
Name:
Mitogen-activated protein kinase 14
Synonyms:
CSAID-binding protein CSBP1 CSPB1 MAP kinase 14 MAP kinase p38 alpha MAPK14 MK14_HUMAN Mitogen-activated protein kinase p38 alpha Stress-activated protein kinase 2a | p38 MAP kinase alpha/beta
Type:
Serine/threonine-protein kinase
Mol. Mass.:
41286.76
Organism:
Homo sapiens (Human)
Description:
Q16539
Residue:
360
  
Inhibitor
Name:
BDBM84976
Synonyms:
Patuletin
Type:
Small organic molecule
Emp. Form.:
C16H12O8
Mol. Mass.:
332.2617
SMILES:
COc1c(O)cc2oc(-c3ccc(O)c(O)c3)c(O)c(=O)c2c1O
: