Target
Somatostatin receptor type 1
Ligand
BDBM82253
Substrate
Ki
6.3±n/a nM
Comments
PDSP_382
Citation
 Bruns, CRaulf, FHoyer, DSchloos, JLübbert, HWeckbecker, G Binding properties of somatostatin receptor subtypes. Metab Clin Exp 45:17-20 (1996)  
Target
Name:
Somatostatin receptor type 1
Synonyms:
SOMATOSTATIN SST1 SS-1-R SS1R SSTR1 | Somatostatin receptor type 1 (SSTR1)
Type:
Enzyme
Mol. Mass.:
42692.81
Organism:
Homo sapiens (Human)
Description:
P30872
Residue:
391
  
Inhibitor
Name:
BDBM82253
Synonyms:
BIM 23052 | CAS_133073-82-2
Type:
Small organic molecule
Emp. Form.:
C61H75N11O10
Mol. Mass.:
1122.3159
SMILES:
C[C@@H](O)[C@H](NC(=O)[C@H](Cc1ccccc1)NC(=O)[C@@H](NC(=O)[C@H](CCCCN)NC(=O)[C@@H](Cc1c[nH]c2ccccc12)NC(=O)[C@H](Cc1ccccc1)NC(=O)[C@H](Cc1ccccc1)NC(=O)[C@H](N)Cc1ccccc1)[C@@H](C)O)C(N)=O
: