Target
Gamma-aminobutyric acid receptor subunit alpha-1
Ligand
BDBM50244035
Substrate
Ki
0.6±n/a nM
Comments
PDSP_350
Citation
 Scholze, PEbert, VSieghart, W Affinity of various ligands for GABAA receptors containing alpha 4 beta 3 gamma 2, alpha 4 gamma 2, or alpha 1 beta 3 gamma 2 subunits. Eur J Pharmacol 304:155-62 (1996)  
Target
Name:
Gamma-aminobutyric acid receptor subunit alpha-1
Synonyms:
Benzodiazepine central GABA A Benzodiazepine liver GABA(A) receptor subunit alpha-1 GABA-A receptor GBRA1_HUMAN TBPS | agonist GABA site
Type:
Protein
Mol. Mass.:
51817.35
Organism:
Homo sapiens (Human)
Description:
P14867
Residue:
456
  
Inhibitor
Name:
BDBM50244035
Synonyms:
Beta CCE cid_105078 | ethyl 9H-pyrido[3,4-b]indole-3-carboxylate
Type:
Small organic molecule
Emp. Form.:
C14H12N2O2
Mol. Mass.:
240.2573
SMILES:
CCOC(=O)c1cc2c(cn1)[nH]c1ccccc21
: