Target
Orexin receptor type 2
Ligand
BDBM274927
Substrate
Meas. Tech.
Intracellular Calcium Assay
IC50
102±n/a nM
Citation
 Kuduk, SDSkudlarek, JW Piperidinyloxy lactone orexin receptor antagonists US Patent  US9556190 Publication Date 1/31/2017 
Target
Name:
Orexin receptor type 2
Synonyms:
HCRTR2 OX2R_HUMAN Orexin receptor type 2 (OR-2) Orexin receptor type 2 (OX2R) Ox-2-R | Ox2-R
Type:
Protein
Mol. Mass.:
50710.53
Organism:
Homo sapiens (Human)
Description:
O43614
Residue:
444
  
Inhibitor
Name:
BDBM274927
Synonyms:
4-{[(3R,6R)-1-{[2-fluoro-6-(3-methyl- 1,2,4-oxadiazol-5- yl)phenyl]carbonyl}-6- methylpiperidin-3-yl]oxy}-1,1- dimethylfuro[3,4-c]pyridin-3(1H)-one | US9556190, Example 17
Type:
Small organic molecule
Emp. Form.:
C25H25FN4O5
Mol. Mass.:
480.4882
SMILES:
C[C@@H]1CC[C@H](CN1C(=O)c1c(F)cccc1-c1nc(C)no1)Oc1nccc2c1C(=O)OC2(C)C
: