Target
Melanocortin receptor 3
Ligand
BDBM82407
Substrate
Ki
7.06±n/a nM
Comments
PDSP_2957
Citation
 Schiöth, HBMuceniece, RWikberg, JE Characterisation of the melanocortin 4 receptor by radioligand binding. Pharmacol Toxicol 79:161-5 (1996)  
Target
Name:
Melanocortin receptor 3
Synonyms:
MC3-R MC3R_HUMAN Melanocortin receptor (M3 and M4)
Type:
Enzyme
Mol. Mass.:
36044.86
Organism:
Homo sapiens (Human)
Description:
P41968
Residue:
323
  
Inhibitor
Name:
BDBM82407
Synonyms:
Gamma1-MSH
Type:
Small organic molecule
Emp. Form.:
C72H97N21O14S
Mol. Mass.:
1512.738
SMILES:
CSCC[C@H](NC(=O)[C@@H](NC(=O)[C@@H](N)Cc1ccc(O)cc1)C(C)C)C(=O)NCC(=O)N[C@@H](Cc1cnc[nH]1)C(=O)N[C@@H](Cc1ccccc1)C(=O)N[C@@H](CCCN=C(N)N)C(=O)N[C@@H](Cc1c[nH]c2ccccc12)C(=O)N[C@@H](CC(O)=O)C(=O)N[C@@H](CCCN=C(N)N)C(=O)N[C@@H](Cc1ccccc1)C(N)=O
: