Target
Diacylglycerol O-acyltransferase 2
Ligand
BDBM274973
Substrate
Meas. Tech.
Enzymatic Activity Assay
pH
7±n/a
Temperature
298.15±n/a K
IC50
68.9±n/a nM
Comments
extracted
Citation
 Imbriglio, JLondon, CLu, ZTata, JXiong, YYou, MYoum, H Tetrahydroisoquinoline derivatives useful as inhibitors of diacylglyceride O-acyltransferase 2 US Patent  US9877957 Publication Date 1/30/2018 
Target
Name:
Diacylglycerol O-acyltransferase 2
Synonyms:
ARAT DGAT2 Diacylglycerol O-acyltransferase 2 (DGAT2) Retinol O-fatty-acyltransferase
Type:
Multi-pass membrane protein
Mol. Mass.:
43848.90
Organism:
Homo sapiens (Human)
Description:
Q96PD7
Residue:
388
  
Inhibitor
Name:
BDBM274973
Synonyms:
N2-(tert-butyl)-N8-(2-(6-methoxy-1H- benzo[d]imidazol-2-yl)ethyl)-5-(3- (trifluoromethoxy)phenyl)-3,4- dihydroisoquinoline-2,8(1H)-dicarboxamide | US9877957, Example 13
Type:
Small organic molecule
Emp. Form.:
C32H34F3N5O4
Mol. Mass.:
609.6387
SMILES:
COc1ccc2nc(CCNC(=O)c3ccc(-c4cccc(OC(F)(F)F)c4)c4CCN(Cc34)C(=O)NC(C)(C)C)[nH]c2c1
: