Target
5-hydroxytryptamine receptor 7
Ligand
BDBM85032
Substrate
Ki
35±n/a nM
Comments
PDSP_842
Citation
 Schotte, AJanssen, PFGommeren, WLuyten, WHVan Gompel, PLesage, ASDe Loore, KLeysen, JE Risperidone compared with new and reference antipsychotic drugs: in vitro and in vivo receptor binding. Psychopharmacology (Berl) 124:57-73 (1996)  
Target
Name:
5-hydroxytryptamine receptor 7
Synonyms:
5-HT-7 5-HT7 5-hydroxytryptamine receptor 7 (5HT7) 5HT7R_MOUSE Serotonin 7 (5-HT7) receptor
Type:
Enzyme
Mol. Mass.:
49932.71
Organism:
Mus musculus (Mouse)
Description:
P32304
Residue:
448
  
Inhibitor
Name:
BDBM85032
Synonyms:
CAS_54965-22-9 NSC_166535
Type:
Small organic molecule
Emp. Form.:
C23H25F2N3O2
Mol. Mass.:
413.4603
SMILES:
Fc1ccc(cc1)N1CNC(=O)C11CCN(CCCC(=O)c2ccc(F)cc2)CC1
: