Target
Alpha-1A adrenergic receptor
Ligand
BDBM50133938
Substrate
Ki
0.17±n/a nM
Comments
PDSP_226
Citation
 Schotte, AJanssen, PFGommeren, WLuyten, WHVan Gompel, PLesage, ASDe Loore, KLeysen, JE Risperidone compared with new and reference antipsychotic drugs: in vitro and in vivo receptor binding. Psychopharmacology (Berl) 124:57-73 (1996)  
Target
Name:
Alpha-1A adrenergic receptor
Synonyms:
ADA1A_RAT Adra1c Alpha-1A adrenoceptor Alpha-1C adrenergic receptor | adrenergic Alpha1A
Type:
Protein
Mol. Mass.:
51620.15
Organism:
Rattus norvegicus (Rat)
Description:
P43140
Residue:
466
  
Inhibitor
Name:
BDBM50133938
Synonyms:
Aceperone N-{1-[4-(4-Fluoro-phenyl)-4-oxo-butyl]-4-phenyl-piperidin-4-ylmethyl}-acetamide
Type:
Small organic molecule
Emp. Form.:
C24H29FN2O2
Mol. Mass.:
396.4977
SMILES:
CC(=O)NCC1(CCN(CCCC(=O)c2ccc(F)cc2)CC1)c1ccccc1
: