Target
D(2) dopamine receptor
Ligand
BDBM84994
Substrate
Ki
2±n/a nM
Comments
PDSP_1422
Citation
 Schotte, AJanssen, PFGommeren, WLuyten, WHVan Gompel, PLesage, ASDe Loore, KLeysen, JE Risperidone compared with new and reference antipsychotic drugs: in vitro and in vivo receptor binding. Psychopharmacology (Berl) 124:57-73 (1996)  
Target
Name:
D(2) dopamine receptor
Synonyms:
DOPAMINE D2 DOPAMINE D2 Short Dopamine D2 receptor Drd2
Type:
G Protein-Coupled Receptor (GPCR)
Mol. Mass.:
50931.60
Organism:
Rattus norvegicus (rat)
Description:
P61169
Residue:
444
  
Inhibitor
Name:
BDBM84994
Synonyms:
CAS_163091 ORG-5222
Type:
Small organic molecule
Emp. Form.:
C17H16ClNO
Mol. Mass.:
285.768
SMILES:
CN1CC2C(C1)c1cc(Cl)ccc1Oc1ccccc21
: