Target
Histamine H1 receptor
Ligand
BDBM84994
Substrate
Ki
0.16±n/a nM
Comments
PDSP_1422
Citation
 Schotte, AJanssen, PFGommeren, WLuyten, WHVan Gompel, PLesage, ASDe Loore, KLeysen, JE Risperidone compared with new and reference antipsychotic drugs: in vitro and in vivo receptor binding. Psychopharmacology (Berl) 124:57-73 (1996)  
Target
Name:
Histamine H1 receptor
Synonyms:
H1R HISTAMINE H1 HRH1_HUMAN
Type:
G Protein-Coupled Receptor (GPCR)
Mol. Mass.:
55808.72
Organism:
Homo sapiens (Human)
Description:
Cell pellets from SK-N-MC cells transfected with human H1 receptor were used in binding assay.
Residue:
487
  
Inhibitor
Name:
BDBM84994
Synonyms:
CAS_163091 ORG-5222
Type:
Small organic molecule
Emp. Form.:
C17H16ClNO
Mol. Mass.:
285.768
SMILES:
CN1CC2C(C1)c1cc(Cl)ccc1Oc1ccccc21
: