Target
Beta-arrestin-1
Ligand
BDBM35255
Substrate
Ki
1000±n/a nM
Comments
PDSP_2002
Citation
 Schotte, AJanssen, PFGommeren, WLuyten, WHVan Gompel, PLesage, ASDe Loore, KLeysen, JE Risperidone compared with new and reference antipsychotic drugs: in vitro and in vivo receptor binding. Psychopharmacology (Berl) 124:57-73 (1996)  
Target
Name:
Beta-arrestin-1
Synonyms:
ARRB1 Beta-arrestin-1 OPIATE Delta | PAF Platelet activating factor
Type:
Enzyme Catalytic Domain
Mol. Mass.:
46360.54
Organism:
RABBIT
Description:
Cholinergic, muscarinic 0 RABBIT::Q95223
Residue:
410
  
Inhibitor
Name:
BDBM35255
Synonyms:
2-Chlor-11-(2-dimethylaminoaethoxy)-dibenzo(b,f)-thiepin 2-[(8-chlorodibenzo[b,f]thiepin-10-yl)oxy]-N,N-dimethylethanamine Nipolept zotepine
Type:
Small organic molecule
Emp. Form.:
C18H18ClNOS
Mol. Mass.:
331.86
SMILES:
CN(C)CCOC1=Cc2ccccc2Sc2ccc(Cl)cc12
: