Target
5-hydroxytryptamine receptor 4
Ligand
BDBM29525
Substrate
Ki
0.31±n/a nM
Comments
PDSP_880
Citation
 Claeysen, SSebben, MJournot, LBockaert, JDumuis, A Cloning, expression and pharmacology of the mouse 5-HT(4L) receptor. FEBS Lett 398:19-25 (1996)  
Target
Name:
5-hydroxytryptamine receptor 4
Synonyms:
5-HT-4 5-HT4L 5HT4R_MOUSE Serotonin 4 (5-HT4) receptor | Serotonin receptor 4
Type:
Enzyme Catalytic Domain
Mol. Mass.:
43970.99
Organism:
MOUSE
Description:
5-HT4 HTR4 MOUSE::P97288
Residue:
388
  
Inhibitor
Name:
BDBM29525
Synonyms:
3H-GR113808 GR 113808 [3H]GR113808
Type:
radiolabeled ligand
Emp. Form.:
C19H27N3O4S
Mol. Mass.:
393.5
SMILES:
Cn1cc(C(=O)OCC2CCN(CCNS(C)(=O)=O)CC2)c2ccccc12
: