Target
5-hydroxytryptamine receptor 2A
Ligand
BDBM50051563
Substrate
Ki
1639±n/a nM
Comments
PDSP_1932
Citation
 Merchant, KMGill, GSHarris, DWHuff, RMEaton, MJLookingland, KLutzke, BSMccall, RBPiercey, MFSchreur, PJSethy, VHSmith, MWSvensson, KATang, AHVonvoigtlander, PFTenbrink, RE Pharmacological characterization of U-101387, a dopamine D4 receptor selective antagonist. J Pharmacol Exp Ther 279:1392-403 (1996) Target
Name:
5-hydroxytryptamine receptor 2A
Synonyms:
5-HT-2A 5-HT2A 5-hydroxytryptamine receptor 2A (5HT2A) Htr2 Serotonin Receptor 2A
Type:
G Protein-Coupled Receptor (GPCR)
Mol. Mass.:
52852.05
Organism:
Rattus norvegicus (rat)
Description:
Rat cortex membranes 5-HT2A receptors.
Residue:
471
  
Inhibitor
Name:
BDBM50051563
Synonyms:
4-[4-((R)-2-Isochroman-1-yl-ethyl)-piperazin-1-yl]-benzenesulfonamide U-101387
Type:
Small organic molecule
Emp. Form.:
C21H27N3O3S
Mol. Mass.:
401.522
SMILES:
NS(=O)(=O)c1ccc(cc1)N1CCN(CC[C@H]2OCCc3ccccc23)CC1
: