Target
Alpha-2C adrenergic receptor
Ligand
BDBM50051563
Substrate
Ki
2600±n/a nM
Comments
PDSP_1932
Citation
 Merchant, KMGill, GSHarris, DWHuff, RMEaton, MJLookingland, KLutzke, BSMccall, RBPiercey, MFSchreur, PJSethy, VHSmith, MWSvensson, KATang, AHVonvoigtlander, PFTenbrink, RE Pharmacological characterization of U-101387, a dopamine D4 receptor selective antagonist. J Pharmacol Exp Ther 279:1392-403 (1996) Target
Name:
Alpha-2C adrenergic receptor
Synonyms:
ADA2C_RAT Adrenergic receptor alpha adrenergic Alpha2 | adrenergic Alpha2C
Type:
Enzyme Catalytic Domain
Mol. Mass.:
49890.50
Organism:
RAT
Description:
adrenergic Alpha2 0 RAT::P22086
Residue:
458
  
Inhibitor
Name:
BDBM50051563
Synonyms:
4-[4-((R)-2-Isochroman-1-yl-ethyl)-piperazin-1-yl]-benzenesulfonamide U-101387
Type:
Small organic molecule
Emp. Form.:
C21H27N3O3S
Mol. Mass.:
401.522
SMILES:
NS(=O)(=O)c1ccc(cc1)N1CCN(CC[C@H]2OCCc3ccccc23)CC1
: