Target
Transient receptor potential cation channel subfamily V member 1
Ligand
BDBM236092
Substrate
Meas. Tech.
pH-Based Assay
pH
7.4±n/a
IC50
0.900±n/a nM
Comments
extracted
Citation
 Tafesse, L TRPV1 antagonists including dihydroxy substituent and uses thereof US Patent  US9878991 Publication Date 1/30/2018 
Target
Name:
Transient receptor potential cation channel subfamily V member 1
Synonyms:
Capsaicin receptor Osm-9-like TRP channel 1 TRPV1_HUMAN Transient receptor potential cation channel subfamily V member 1 (TRPV1) Transient receptor potential cation channel subfamily V member 1(TRPV1) Vanilloid VR1 Vanilloid receptor 1 Vanilloid receptor 1 (VRI/TRPV1)
Type:
Protein
Mol. Mass.:
94960.75
Organism:
Homo sapiens (Human)
Description:
Q8NER1
Residue:
839
  
Inhibitor
Name:
BDBM236092
Synonyms:
US9365563, D1 | US9878991, Compound D1
Type:
Small organic molecule
Emp. Form.:
C23H28FN3O3
Mol. Mass.:
413.4851
SMILES:
CC(C)(C)c1ccc(NC(=O)N2CCC(=CC2)c2ncc(cc2F)[C@H](O)CO)cc1
: