Target
Transient receptor potential cation channel subfamily V member 1
Ligand
BDBM236122
Substrate
Meas. Tech.
pH-Based Assay
pH
7.4±n/a
IC50
13.1±2.1 nM
Comments
extracted
Citation
 Tafesse, L TRPV1 antagonists including dihydroxy substituent and uses thereof US Patent  US9878991 Publication Date 1/30/2018 
Target
Name:
Transient receptor potential cation channel subfamily V member 1
Synonyms:
Capsaicin receptor Osm-9-like TRP channel 1 TRPV1_HUMAN Transient receptor potential cation channel subfamily V member 1 (TRPV1) Transient receptor potential cation channel subfamily V member 1(TRPV1) Vanilloid VR1 Vanilloid receptor 1 Vanilloid receptor 1 (VRI/TRPV1)
Type:
Protein
Mol. Mass.:
94960.75
Organism:
Homo sapiens (Human)
Description:
Q8NER1
Residue:
839
  
Inhibitor
Name:
BDBM236122
Synonyms:
US9365563, H2 | US9878991, Compound H2
Type:
Small organic molecule
Emp. Form.:
C20H18Cl2F3N3O4
Mol. Mass.:
492.276
SMILES:
OC[C@@H](O)c1cnc(C2=CCN(CC2)C(=O)Nc2ccc(OC(F)(F)F)c(Cl)c2)c(Cl)c1
: