Target
Transient receptor potential cation channel subfamily V member 1
Ligand
BDBM236215
Substrate
Meas. Tech.
Capsaicin-Based Assay
pH
7.4±n/a
IC50
9.80±2.3 nM
Comments
extracted
Citation
 Tafesse, L TRPV1 antagonists including dihydroxy substituent and uses thereof US Patent  US9878991 Publication Date 1/30/2018 
Target
Name:
Transient receptor potential cation channel subfamily V member 1
Synonyms:
Capsaicin receptor Osm-9-like TRP channel 1 TRPV1_HUMAN Transient receptor potential cation channel subfamily V member 1 (TRPV1) Transient receptor potential cation channel subfamily V member 1(TRPV1) Vanilloid VR1 Vanilloid receptor 1 Vanilloid receptor 1 (VRI/TRPV1)
Type:
Protein
Mol. Mass.:
94960.75
Organism:
Homo sapiens (Human)
Description:
Q8NER1
Residue:
839
  
Inhibitor
Name:
BDBM236215
Synonyms:
US9365563, K6 | US9878991, Compound K6
Type:
Small organic molecule
Emp. Form.:
C22H29ClN4O3
Mol. Mass.:
432.944
SMILES:
CC(C)(C)c1ccc(NC(=O)N2CCN(CC2)c2ncc(cc2Cl)[C@H](O)CO)cc1
: