Target
Gamma-aminobutyric acid receptor subunit alpha-4
Ligand
BDBM50034835
Substrate
Ki
6±n/a nM
Comments
PDSP_1606
Citation
 Gunnersen, DKaufman, CMSkolnick, P Pharmacological properties of recombinant "diazepam-insensitive" GABAA receptors. Neuropharmacology 35:1307-14 (1996)  
Target
Name:
Gamma-aminobutyric acid receptor subunit alpha-4
Synonyms:
GBRA4_RAT Gamma-aminobutyric acid receptor (GABA(A)) subunit alpha-4
Type:
Enzyme
Mol. Mass.:
60972.37
Organism:
Rattus norvegicus (Rat)
Description:
P28471
Residue:
552
  
Inhibitor
Name:
BDBM50034835
Synonyms:
5-Methyl-6-oxo-5,6-dihydro-4H-7-thia-2,5,9b-triaza-cyclopenta[e]azulene-3-carboxylic acid tert-butyl ester Ro 19-4603 | Ro-19-4603
Type:
Small organic molecule
Emp. Form.:
C15H17N3O3S
Mol. Mass.:
319.379
SMILES:
CN1Cc2c(ncn2-c2ccsc2C1=O)C(=O)OC(C)(C)C
: