Target
Gamma-aminobutyric acid receptor subunit alpha-6
Ligand
BDBM84957
Substrate
Ki
500±n/a nM
Comments
PDSP_504
Citation
 Gunnersen, DKaufman, CMSkolnick, P Pharmacological properties of recombinant "diazepam-insensitive" GABAA receptors. Neuropharmacology 35:1307-14 (1996)  
Target
Name:
Gamma-aminobutyric acid receptor subunit alpha-6
Synonyms:
GABA A Alpha6Beta3Gamma2 GABA receptor alpha-6 subunit Gabra-6 Gamma-aminobutyric acid receptor subunit alpha-6
Type:
Enzyme Catalytic Domain
Mol. Mass.:
51188.24
Organism:
RAT
Description:
GABA A Alpha6Beta2Gamma2 0 RAT::P30191
Residue:
453
  
Inhibitor
Name:
BDBM84957
Synonyms:
CGS 9896 | CHEMBL20042
Type:
Small organic molecule
Emp. Form.:
C16H10ClN3O
Mol. Mass.:
295.723
SMILES:
Clc1ccc(cc1)-n1[nH]c2c(cnc3ccccc23)c1=O
: