Target
Somatostatin receptor type 5
Ligand
BDBM50063839
Substrate
Ki
0.37±n/a nM
Comments
PDSP_3365
Citation
 Shimon, ITaylor, JEDong, JZBitonte, RAKim, SMorgan, BCoy, DHCuller, MDMelmed, S Somatostatin receptor subtype specificity in human fetal pituitary cultures. Differential role of SSTR2 and SSTR5 for growth hormone, thyroid-stimulating hormone, and prolactin regulation. J Clin Invest 99:789-98 (1997)  
Target
Name:
Somatostatin receptor type 5
Synonyms:
SOMATOSTATIN SST5 SS5-R SSR5_HUMAN Somatostatin receptor type 5 (SSTR5)
Type:
Enzyme
Mol. Mass.:
39218.02
Organism:
Homo sapiens (Human)
Description:
P35346
Residue:
364
  
Inhibitor
Name:
BDBM50063839
Synonyms:
BIM 23268 H-cyclo[DCys-Phe-Phe-DTrp-Lys-Thr-Phe-DCys]-NH2
Type:
Small organic molecule
Emp. Form.:
C54H67N11O9S2
Mol. Mass.:
1078.308
SMILES:
CC(O)[C@H]1NC(=O)[C@H](CCCCN)NC(=O)[C@H](Cc2c[nH]c3ccccc23)NC(=O)[C@H](Cc2ccccc2)NC(=O)[C@@H](Cc2ccccc2)NC(=O)[C@H](N)CSSC[C@@H](NC(=O)[C@H](Cc2ccccc2)NC1=O)C(N)=O
: