Target
D(2) dopamine receptor
Ligand
BDBM81487
Substrate
Ki
0.5±n/a nM
Comments
PDSP_540
Citation
 Creese, IBurt, DRSnyder, SH Dopamine receptor binding predicts clinical and pharmacological potencies of antischizophrenic drugs. J Neuropsychiatry Clin Neurosci 8:223-6 (1996)  
Target
Name:
D(2) dopamine receptor
Synonyms:
DOPAMINE D2 DRD2_BOVIN | Dopamine D2 receptor
Type:
Enzyme Catalytic Domain
Mol. Mass.:
50698.79
Organism:
BOVINE
Description:
P20288
Residue:
444
  
Inhibitor
Name:
BDBM81487
Synonyms:
CAS_10457-91-7 NSC_25293
Type:
Small organic molecule
Emp. Form.:
C22H22ClF4NO2
Mol. Mass.:
443.862
SMILES:
OC1(CCN(CCCC(=O)c2ccc(F)cc2)CC1)c1ccc(Cl)c(c1)C(F)(F)F
: