Target
Nitric oxide synthase, brain
Ligand
BDBM275055
Substrate
Meas. Tech.
Caco-2 Assay
Ki
138±n/a nM
Citation
 Silverman, RBMukherjee, PNguyen, HM 2-imidazolyl-pyrimidine scaffolds as potent and selective inhibitors of neuronal nitric oxide synthase US Patent  US9878996 Publication Date 1/30/2018 
Target
Name:
Nitric oxide synthase, brain
Synonyms:
Constitutive NOS NC-NOS NOS type I nNOS NOS1_HUMAN Neuronal nitric oxide synthase Nitric oxide synthase, neuronal (nNOS) bNOS | nNOS
Type:
Homodimer
Mol. Mass.:
160985.98
Organism:
Homo sapiens (Human)
Description:
P29475
Residue:
1434
  
Inhibitor
Name:
BDBM275055
Synonyms:
US9878996, Compound 28
Type:
Small organic molecule
Emp. Form.:
C17H16N6
Mol. Mass.:
304.3491
SMILES:
[C-]#[N+]c1cccc(CNCCc2ccnc(n2)-n2ccnc2)c1
: