Target
Melatonin receptor
Ligand
BDBM85053
Substrate
Ki
58±n/a nM
Comments
PDSP_884
Citation
 Dubocovich, MLMasana, MIIacob, SSauri, DM Melatonin receptor antagonists that differentiate between the human Mel1a and Mel1b recombinant subtypes are used to assess the pharmacological profile of the rabbit retina ML1 presynaptic heteroreceptor. Naunyn Schmiedebergs Arch Pharmacol 355:365-75 (1997)  
Target
Name:
Melatonin receptor
Synonyms:
Melatonin | Melatonin receptor
Type:
Enzyme Catalytic Domain
Mol. Mass.:
13287.02
Organism:
RABBIT
Description:
Q9BE38
Residue:
114
  
Inhibitor
Name:
BDBM85053
Synonyms:
1-[2-(5-Methoxy-1H-indol-3-yl)ethyl]pyrrolidin-2-one | GR 135533
Type:
Small organic molecule
Emp. Form.:
C15H18N2O2
Mol. Mass.:
258.3156
SMILES:
COc1ccc2[nH]cc(CCN3CCCC3=O)c2c1
: