Target
Melatonin receptor
Ligand
BDBM29611
Substrate
Ki
0.27±n/a nM
Comments
PDSP_1192
Citation
 Dubocovich, MLMasana, MIIacob, SSauri, DM Melatonin receptor antagonists that differentiate between the human Mel1a and Mel1b recombinant subtypes are used to assess the pharmacological profile of the rabbit retina ML1 presynaptic heteroreceptor. Naunyn Schmiedebergs Arch Pharmacol 355:365-75 (1997)  
Target
Name:
Melatonin receptor
Synonyms:
Melatonin | Melatonin receptor
Type:
Enzyme Catalytic Domain
Mol. Mass.:
13287.02
Organism:
RABBIT
Description:
Q9BE38
Residue:
114
  
Inhibitor
Name:
BDBM29611
Synonyms:
2-Iodomelatonin Melatonin,2-Iodo
Type:
Small organic molecule
Emp. Form.:
C13H15IN2O2
Mol. Mass.:
358.1749
SMILES:
COc1ccc2[nH]c(I)c(CCNC(C)=O)c2c1
: