Target
Metabotropic glutamate receptor 4
Ligand
BDBM85017
Substrate
Ki
>10000±n/a nM
Comments
PDSP_2019
Citation
 Conn, PJPin, JP Pharmacology and functions of metabotropic glutamate receptors. Annu Rev Pharmacol Toxicol 37:205-37 (1997)  
Target
Name:
Metabotropic glutamate receptor 4
Synonyms:
GPRC1D GRM4_HUMAN MGLUR4 Metabotropic glutamate receptor 4 (mGlu4) metabotropic glutamate 4
Type:
Protein
Mol. Mass.:
101899.95
Organism:
Homo sapiens (Human)
Description:
Q14833
Residue:
912
  
Inhibitor
Name:
BDBM85017
Synonyms:
(1S,3S)-1-AMINO-1-CARBOXYCYCLOPENTANE-3-ACETIC ACID 1S, 3S-ACPD
Type:
Small organic molecule
Emp. Form.:
C8H13NO4
Mol. Mass.:
187.1931
SMILES:
N[C@]1(CC[C@H](CC(O)=O)C1)C(O)=O
: