Target
5-hydroxytryptamine receptor 1D
Ligand
BDBM86708
Substrate
Ki
2450±n/a nM
Comments
PDSP_1954
Citation
 Mos, JVan Hest, AVan Drimmelen, MHerremans, AHOlivier, B The putative 5-HT1A receptor antagonist DU125530 blocks the discriminative stimulus of the 5-HT1A receptor agonist flesinoxan in pigeons. Eur J Pharmacol 325:145-53 (1997)  
Target
Name:
5-hydroxytryptamine receptor 1D
Synonyms:
5-HT1D | HTR1D
Type:
Enzyme Catalytic Domain
Mol. Mass.:
41807.41
Organism:
pigeon
Description:
5-HT1D HTR1D pigeon::A0A1V4JDN9
Residue:
375
  
Inhibitor
Name:
BDBM86708
Synonyms:
CAS_146714-97-8 CHEMBL514874 NSC_104911 | WAY 100,635
Type:
Small organic molecule
Emp. Form.:
C25H34N4O2
Mol. Mass.:
422.5631
SMILES:
COc1ccccc1N1CCN(CCN(C(=O)C2CCCCC2)c2ccccn2)CC1
: