Target
5-hydroxytryptamine receptor 2A
Ligand
BDBM50019443
Substrate
Ki
>10000±n/a nM
Comments
PDSP_1495
Citation
 Mos, JVan Hest, AVan Drimmelen, MHerremans, AHOlivier, B The putative 5-HT1A receptor antagonist DU125530 blocks the discriminative stimulus of the 5-HT1A receptor agonist flesinoxan in pigeons. Eur J Pharmacol 325:145-53 (1997)  
Target
Name:
5-hydroxytryptamine receptor 2A
Synonyms:
5-HT2A | HTR2A
Type:
Enzyme Catalytic Domain
Mol. Mass.:
105583.25
Organism:
pigeon
Description:
5-HT2A HTR2A pigeon::A0A1V4J4E5
Residue:
946
  
Inhibitor
Name:
BDBM50019443
Synonyms:
1-(1H-Indol-4-yloxy)-3-isopropylamino-propan-2-ol 1-(1H-Indol-4-yloxy)-3-isopropylamino-propan-2-ol(pindolol) LB-46 PINDOLOL,(-) VISKAZIDE | VISKEN
Type:
Small organic molecule
Emp. Form.:
C14H20N2O2
Mol. Mass.:
248.3208
SMILES:
CC(C)NCC(O)COc1cccc2[nH]ccc12
: