Target
Alpha-1A adrenergic receptor
Ligand
BDBM82517
Substrate
Ki
0.7±n/a nM
Comments
PDSP_1289
Citation
 Mos, JVan Hest, AVan Drimmelen, MHerremans, AHOlivier, B The putative 5-HT1A receptor antagonist DU125530 blocks the discriminative stimulus of the 5-HT1A receptor agonist flesinoxan in pigeons. Eur J Pharmacol 325:145-53 (1997)  
Target
Name:
Alpha-1A adrenergic receptor
Synonyms:
adrenergic Alpha1
Type:
Enzyme Catalytic Domain
Mol. Mass.:
50699.64
Organism:
pigeon
Description:
adrenergic Alpha1 0 pigeon::A0A1V4KJJ8
Residue:
464
  
Inhibitor
Name:
BDBM82517
Synonyms:
2-{4-[4-(2-Methoxy-phenyl)-piperazin-1-yl]-butyl}-isoindole-1,3-dione CHEMBL126632 NAN-190 | NSC_107966
Type:
Small organic molecule
Emp. Form.:
C23H27N3O3
Mol. Mass.:
393.4788
SMILES:
COc1ccccc1N1CCN(CCCCN2C(=O)c3ccccc3C2=O)CC1
: