Target
D(3) dopamine receptor
Ligand
BDBM82517
Substrate
Ki
9.3±n/a nM
Comments
PDSP_1289
Citation
 Mos, JVan Hest, AVan Drimmelen, MHerremans, AHOlivier, B The putative 5-HT1A receptor antagonist DU125530 blocks the discriminative stimulus of the 5-HT1A receptor agonist flesinoxan in pigeons. Eur J Pharmacol 325:145-53 (1997)  
Target
Name:
D(3) dopamine receptor
Synonyms:
DOPAMINE D3 | DRD3
Type:
Enzyme Catalytic Domain
Mol. Mass.:
47809.00
Organism:
pigeon
Description:
DOPAMINE D3 DRD3 pigeon::A0A1V4J3K6
Residue:
425
  
Inhibitor
Name:
BDBM82517
Synonyms:
2-{4-[4-(2-Methoxy-phenyl)-piperazin-1-yl]-butyl}-isoindole-1,3-dione CHEMBL126632 NAN-190 | NSC_107966
Type:
Small organic molecule
Emp. Form.:
C23H27N3O3
Mol. Mass.:
393.4788
SMILES:
COc1ccccc1N1CCN(CCCCN2C(=O)c3ccccc3C2=O)CC1
: