Target
D(3) dopamine receptor
Ligand
BDBM82369
Substrate
Ki
>10000±n/a nM
Comments
PDSP_1953
Citation
 Mos, JVan Hest, AVan Drimmelen, MHerremans, AHOlivier, B The putative 5-HT1A receptor antagonist DU125530 blocks the discriminative stimulus of the 5-HT1A receptor agonist flesinoxan in pigeons. Eur J Pharmacol 325:145-53 (1997)  
Target
Name:
D(3) dopamine receptor
Synonyms:
DOPAMINE D3 | DRD3
Type:
Enzyme Catalytic Domain
Mol. Mass.:
47809.00
Organism:
pigeon
Description:
DOPAMINE D3 DRD3 pigeon::A0A1V4J3K6
Residue:
425
  
Inhibitor
Name:
BDBM82369
Synonyms:
CAS_133025-23-7 WAY 100135
Type:
Small organic molecule
Emp. Form.:
C24H33N3O2
Mol. Mass.:
395.5377
SMILES:
COc1ccccc1N1CCN(C[C@@H](C(=O)NC(C)(C)C)c2ccccc2)CC1
: