Target
Protein kinase C epsilon type
Ligand
BDBM3208
Substrate
Lysine-rich histone
Meas. Tech.
PKC assay
pH
7.5±n/a
Temperature
303.15±n/a K
IC50
97000±n/a nM
Citation
 Lampe, JWBiggers, CKDefauw, JMFoglesong, RJHall, SEHeerding, JMHollinshead, SPHu, HHughes, PFJagdmann, GEJohnson, MGLai, YSLowden, CTLynch, MPMendoza, JSMurphy, MMWilson, JWBallas, LMCarter, KDarges, JWDavis, JEHubbard, FRStamper, ML Synthesis and protein kinase inhibitory activity of balanol analogues with modified benzophenone subunits. J Med Chem 45:2624-43 (2002)  
Target
Name:
Protein kinase C epsilon type
Synonyms:
KPCE_HUMAN PKCE Protein kinase C epsilon Protein kinase C, PKC; classical/novel nPKC-epsilon
Type:
Enzyme
Mol. Mass.:
83680.45
Organism:
Homo sapiens (Human)
Description:
The recombinant human PKC enzymes were produced using a baculovirus expression system in SF9 cells
Residue:
737
  
Inhibitor
Name:
BDBM3208
Synonyms:
(1S,2R)-2-{[2,6-dihydroxy-4-({[(3R,4R)-3-[(4-hydroxybenzene)amido]azepan-4-yl]oxy}carbonyl)phenyl]carbonyl}cyclohexane-1-carboxylic acid Modified Benzophenone Ring, Balanol Analog 8
Type:
Small organic molecule
Emp. Form.:
C28H32N2O9
Mol. Mass.:
540.5617
SMILES:
OC(=O)[C@H]1CCCC[C@H]1C(=O)c1c(O)cc(cc1O)C(=O)O[C@@H]1CCCNC[C@H]1NC(=O)c1ccc(O)cc1
:
Substrate
Name:
Lysine-rich histone
Synonyms:
ING Peptide histone type IIIS
Type:
Peptide
Mol. Mass.:
10508.21
Organism:
Bos taurus (bovine)
Description:
Purified as a lysine rich fraction of histone H1 from calf thymus.
Residue:
105