Target
Nicotinic acetylcholine receptor
Ligand
BDBM50107863
Substrate
Ki
3.7±n/a nM
Comments
PDSP_608
Citation
 Dávila-García, MIMusachio, JLPerry, DCXiao, YHorti, ALondon, EDDannals, RFKellar, KJ [125I]IPH, an epibatidine analog, binds with high affinity to neuronal nicotinic cholinergic receptors. J Pharmacol Exp Ther 282:445-51 (1997) Target
Name:
Nicotinic acetylcholine receptor
Synonyms:
Nicotinic acetylcholine receptor | n-AChR
Type:
Enzyme Catalytic Domain
Mol. Mass.:
2478.99
Organism:
RAT
Description:
n-AChR 0 RAT::Q62594
Residue:
23
  
Inhibitor
Name:
BDBM50107863
Synonyms:
(-)-cytisine (1S,9R)-7,11-diazatricyclo[7.3.1.0~2,7~]trideca-2,4-dien-6-one 1,2,3,4,5,6-Hexahydro-1,5-methano-pyrido[1,2-a][1,5]diazocin-8-one (cytisine) ChEMBL_66244 Cytisine1,2,3,4,5,6-Hexahydro-1,5-methano-pyrido[1,2-a][1,5]diazocin-8-one | cytisine
Type:
Small organic molecule
Emp. Form.:
C11H14N2O
Mol. Mass.:
190.2417
SMILES:
O=c1cccc2[C@H]3CNC[C@@H](C3)Cn12
: