Target
5-hydroxytryptamine receptor 2B
Ligand
BDBM30704
Substrate
Ki
0.74±n/a nM
Comments
PDSP_1209
Citation
 Bonhaus, DWWeinhardt, KKTaylor, MDeSouza, AMcNeeley, PMSzczepanski, KFontana, DJTrinh, JRocha, CLDawson, MWFlippin, LAEglen, RM RS-102221: a novel high affinity and selective, 5-HT2C receptor antagonist. Neuropharmacology 36:621-9 (1997)  
Target
Name:
5-hydroxytryptamine receptor 2B
Synonyms:
5-HT-2B 5-hydroxytryptamine (serotonin) receptor 2B [Homo sapiens] 5-hydroxytryptamine receptor 2C (5HT2C) HTR2B Serotonin 2b (5-HT2b) receptor | Serotonin Receptor 2B
Type:
G Protein-Coupled Receptor (GPCR)
Mol. Mass.:
54312.47
Organism:
Homo sapiens (Human)
Description:
Receptor binding assays were performed using human clone stably expressed in CHO cells.
Residue:
481
  
Inhibitor
Name:
BDBM30704
Synonyms:
(phenylmethyl) N-[[(6aR,9S,10aR)-4,7-dimethyl-6,6a,8,9,10,10a-hexahydroindolo[4,3-fg]quinoline-9-yl]methyl]carbamate METERGOLINE N-[[(6aR,9S,10aR)-4,7-dimethyl-6,6a,8,9,10,10a-hexahydroindolo[4,3-fg]quinoline-9-yl]methyl]carbamic acid (phenylmethyl) ester SMR000059050 cid_28693
Type:
Small organic molecule
Emp. Form.:
C25H29N3O2
Mol. Mass.:
403.5167
SMILES:
CN1C[C@H](CNC(=O)OCc2ccccc2)C[C@H]2[C@H]1Cc1cn(C)c3cccc2c13
: