Target
5-hydroxytryptamine receptor 2C
Ligand
BDBM50001775
Substrate
Ki
0.25±n/a nM
Comments
PDSP_1602
Citation
 Bonhaus, DWWeinhardt, KKTaylor, MDeSouza, AMcNeeley, PMSzczepanski, KFontana, DJTrinh, JRocha, CLDawson, MWFlippin, LAEglen, RM RS-102221: a novel high affinity and selective, 5-HT2C receptor antagonist. Neuropharmacology 36:621-9 (1997)  
Target
Name:
5-hydroxytryptamine receptor 2C
Synonyms:
5-HT-1C 5-HT1C 5-HT2C-INI 5-HTR2C 5-hydroxytryptamine receptor 2C (5-HT-2C) 5HT-1C HTR1C Serotonin (5-HT3) receptor Serotonin Receptor 2C
Type:
G Protein-Coupled Receptor (GPCR)
Mol. Mass.:
51836.79
Organism:
Homo sapiens (Human)
Description:
P28335
Residue:
458
  
Inhibitor
Name:
BDBM50001775
Synonyms:
(ritanserin)6-(2-{4-[Bis-(4-fluoro-phenyl)-methylene]-piperidin-1-yl}-ethyl)-7-methyl-2,3-dihydro-1H-indolizin-5-one 6-(2-(4-(bis(4-fluorophenyl)methylene)piperidin-1-yl)ethyl)-7-methyl-5H-thiazolo[3,2-a]pyrimidin-5-one 6-(2-{4-[Bis-(4-fluoro-phenyl)-methylene]-piperidin-1-yl}-ethyl)-7-methyl-thiazolo[3,2-a]pyrimidin-5-one 6-(2-{4-[Bis-(4-fluoro-phenyl)-methylene]-piperidin-1-yl}-ethyl)-7-methyl-thiazolo[3,2-a]pyrimidin-5-one(Ritanserin) RITANSERIN cid_5074
Type:
Small organic molecule
Emp. Form.:
C27H25F2N3OS
Mol. Mass.:
477.569
SMILES:
[#6]-c1nc2sccn2c(=O)c1-[#6]-[#6]-[#7]-1-[#6]-[#6]\[#6](-[#6]-[#6]-1)=[#6](\c1ccc(F)cc1)-c1ccc(F)cc1
: