Target
Dipeptidyl peptidase 1
Ligand
BDBM201017
Substrate
Meas. Tech.
Inhibition of Human DPPI
Temperature
298.15±n/a K
IC50
0.200±n/a nM
Comments
extracted
Citation
 Vintonyak, VGrauert, MGrundl, MPautsch, A Substituted spirocycles US Patent  US9879026 Publication Date 1/30/2018 
Target
Name:
Dipeptidyl peptidase 1
Synonyms:
CATC_HUMAN CTSC Cathepsin J Dipeptidyl peptidase 1 (DPPI) Dipeptidyl peptidase I (DPPI)
Type:
Enzyme
Mol. Mass.:
51857.28
Organism:
Homo sapiens (Human)
Description:
P53634
Residue:
463
  
Inhibitor
Name:
BDBM201017
Synonyms:
US9540373, 6 USRE47636, Example 6
Type:
Small organic molecule
Emp. Form.:
C29H32FN5O2
Mol. Mass.:
501.5951
SMILES:
CN1CCC2(CC1)C(=O)Nc1ccc(cc21)-c1ccc(C[C@H](NC(=O)[C@H]2N[C@@H]3CC[C@H]2C3)C#N)c(F)c1
: