Target
Dipeptidyl peptidase 1
Ligand
BDBM201020
Substrate
Meas. Tech.
Inhibition of Human DPPI
Temperature
298.15±n/a K
IC50
0.500±n/a nM
Comments
extracted
Citation
 Vintonyak, VGrauert, MGrundl, MPautsch, A Substituted spirocycles US Patent  US9879026 Publication Date 1/30/2018 
Target
Name:
Dipeptidyl peptidase 1
Synonyms:
CATC_HUMAN CTSC Cathepsin J Dipeptidyl peptidase 1 (DPPI) Dipeptidyl peptidase I (DPPI)
Type:
Enzyme
Mol. Mass.:
51857.28
Organism:
Homo sapiens (Human)
Description:
P53634
Residue:
463
  
Inhibitor
Name:
BDBM201020
Synonyms:
US9540373, 9 USRE47636, Example 9
Type:
Small organic molecule
Emp. Form.:
C27H27FN4O3
Mol. Mass.:
474.5267
SMILES:
Fc1cc(ccc1C[C@H](NC(=O)[C@H]1N[C@@H]2CC[C@H]1C2)C#N)-c1ccc2C(=O)OC3(CCNC3)c2c1
: