Target
D(4) dopamine receptor
Ligand
BDBM82479
Substrate
Ki
102±n/a nM
Comments
PDSP_1408
Citation
 Tallman, JFPrimus, RJBrodbeck, RCornfield, LMeade, RWoodruff, KRoss, PThurkauf, AGallager, DW I. NGD 94-1: identification of a novel, high-affinity antagonist at the human dopamine D4 receptor. J Pharmacol Exp Ther 282:1011-9 (1997) Target
Name:
D(4) dopamine receptor
Synonyms:
D(2C) dopamine receptor DOPAMINE D4.2 DRD4 Dopamine D4 receptor
Type:
Enzyme
Mol. Mass.:
48373.19
Organism:
Homo sapiens (Human)
Description:
P21917
Residue:
419
  
Inhibitor
Name:
BDBM82479
Synonyms:
CAS_132539-06-1 OLANZAPINE | USRE49340, Rank 2
Type:
Small organic molecule
Emp. Form.:
C17H20N4S
Mol. Mass.:
312.432
SMILES:
CN1CCN(CC1)C1=c2cc(C)sc2=Nc2ccccc2N1
: