Target
Alkaline phosphatase, tissue-nonspecific isozyme
Ligand
BDBM275093
Substrate
Meas. Tech.
TNAP Inhibition Activity
Temperature
298.15±n/a K
IC50
1.10±n/a nM
Comments
extracted
Citation
 Miyazaki, SYamamoto, YSuzuki, KInui, MIzumi, MSoma, KPinkerton, AShinozaki, T Pyridine compounds US Patent  US9879032 Publication Date 1/30/2018 
Target
Name:
Alkaline phosphatase, tissue-nonspecific isozyme
Synonyms:
ALPL tissue-nonspecific alkaline phosphatase precursor
Type:
PROTEIN
Mol. Mass.:
57306.17
Organism:
Homo sapiens (Human)
Description:
ChEMBL_1448917
Residue:
524
  
Inhibitor
Name:
BDBM275093
Synonyms:
US10221195, Example 40 | US9879032, Example 35
Type:
Small organic molecule
Emp. Form.:
C17H16ClN3O5S
Mol. Mass.:
409.844
SMILES:
COc1ccc(Cl)cc1S(=O)(=O)Nc1cnc2OCC3(CC3)NC(=O)c2c1
: