Target
Galanin receptor type 2
Ligand
BDBM85169
Substrate
Ki
0.5±n/a nM
Comments
PDSP_858
Citation
 Smith, KEForray, CWalker, MWJones, KATamm, JABard, JBranchek, TALinemeyer, DLGerald, C Expression cloning of a rat hypothalamic galanin receptor coupled to phosphoinositide turnover. J Biol Chem 272:24612-6 (1997)  
Target
Name:
Galanin receptor type 2
Synonyms:
GALR2_RAT Galanin receptor 2 Galnr2 | Galr2
Type:
Enzyme Catalytic Domain
Mol. Mass.:
40697.04
Organism:
RAT
Description:
Galanin R2 GALR2 RAT::O08726
Residue:
372
  
Inhibitor
Name:
BDBM85169
Synonyms:
Galanin (1-29), porcine | Galanin [D-Trp2], porcine
Type:
Small organic molecule
Emp. Form.:
C144H210N42O39
Mol. Mass.:
3153.4662
SMILES:
CCC(C)C(NC(=O)C(C)NC(=O)C(Cc1cnc[nH]1)NC(=O)C1CCCN1C(=O)CNC(=O)C(CC(C)C)NC(=O)C(CC(C)C)NC(=O)C(Cc1ccc(O)cc1)NC(=O)CNC(=O)C(C)NC(=O)C(CO)NC(=O)C(CC(N)=O)NC(=O)C(CC(C)C)NC(=O)C(NC(=O)C(Cc1c[nH]c2ccccc12)NC(=O)CN)C(C)O)C(=O)NC(CC(O)=O)C(=O)NC(CC(N)=O)C(=O)NC(Cc1cnc[nH]1)C(=O)NC(CCCN=C(N)N)C(=O)NC(CO)C(=O)NC(Cc1ccccc1)C(=O)NC(Cc1cnc[nH]1)C(=O)NC(CC(O)=O)C(=O)NC(CCCCN)C(=O)NC(CCc1ccc(O)cc1)C(=O)NCC(=O)NC(CC(C)C)C(N)=O
: