Target
Mitogen-activated protein kinase 1
Ligand
BDBM275297
Substrate
Meas. Tech.
IMAP-FP Assay
IC50
0.51±n/a nM
Citation
 Siliphaivanh, PMethot, JLipford, KAMolinari, DSloman, DLWitter, DZhou, HBoyce, CHuang, XLim, JGuerin, DKarunakaran, GBBakshi, RKLiu, ZFu, JWan, ZLiu, W ERK inhibitors US Patent  US9884048 Publication Date 2/6/2018 
Target
Name:
Mitogen-activated protein kinase 1
Synonyms:
ERK2 Extracellular signal-regulated kinase 2 Extracellular signal-regulated kinase 2 (ERK2) MAPK 2 MK01_HUMAN Mitogen-activated protein kinase 1 (ERK-2) Mitogen-activated protein kinase 2 PRKM2 | p42-MAPK
Type:
Ser/Thr Protein Kinase
Mol. Mass.:
41392.76
Organism:
Homo sapiens (Human)
Description:
P28482
Residue:
360
  
Inhibitor
Name:
BDBM275297
Synonyms:
1-[1-(2-methylpyridin-4-yl)- 1H-pyrazolo[3,4-c]pyridin- 5-yl]-3-{(3R,4S)-1-methyl- 4-[2-(trifluoromethyl)- phenyl]pyrrolidin-3-yl}urea | US9884048, Example 191
Type:
Small organic molecule
Emp. Form.:
C25H24F3N7O
Mol. Mass.:
495.4996
SMILES:
CN1C[C@H](NC(=O)Nc2cc3cnn(-c4ccnc(C)c4)c3cn2)[C@H](C1)c1ccccc1C(F)(F)F
: