Target
Mitogen-activated protein kinase 1
Ligand
BDBM275413
Substrate
Meas. Tech.
IMAP-FP Assay
IC50
0.56±n/a nM
Citation
 Siliphaivanh, PMethot, JLipford, KAMolinari, DSloman, DLWitter, DZhou, HBoyce, CHuang, XLim, JGuerin, DKarunakaran, GBBakshi, RKLiu, ZFu, JWan, ZLiu, W ERK inhibitors US Patent  US9884048 Publication Date 2/6/2018 
Target
Name:
Mitogen-activated protein kinase 1
Synonyms:
ERK2 Extracellular signal-regulated kinase 2 Extracellular signal-regulated kinase 2 (ERK2) MAPK 2 MK01_HUMAN Mitogen-activated protein kinase 1 (ERK-2) Mitogen-activated protein kinase 2 PRKM2 | p42-MAPK
Type:
Ser/Thr Protein Kinase
Mol. Mass.:
41392.76
Organism:
Homo sapiens (Human)
Description:
P28482
Residue:
360
  
Inhibitor
Name:
BDBM275413
Synonyms:
(S)-1-(2-methyl-2-hydroxy-1-phenylpropyl)-3-(1-(2-methylpyridin-4-yl)-1H-pyrazolo[3,4-c]pyridin-5-yl)urea | US9884048, Example 292
Type:
Small organic molecule
Emp. Form.:
C23H24N6O2
Mol. Mass.:
416.4757
SMILES:
Cc1cc(ccn1)-n1ncc2cc(NC(=O)N[C@@H](c3ccccc3)C(C)(C)O)ncc12
: